Reaction Details
TargetGag-Pol polyprotein
LigandBDBM188497
Substrate/Competitorn/a
Meas. Tech.Strand Trasnfer Assay
IC50 1.7e+2± 3e+1 nM
Citation Feng, LSharma, ASlaughter, AJena, NKoh, YShkriabai, NLarue, RCPatel, PAMitsuya, HKessl, JJEngelman, AFuchs, JRKvaratskhelia, M The A128T resistance mutation reveals aberrant protein multimerization as the primary mechanism of action of allosteric HIV-1 integrase inhibitors. J Biol Chem288:15813-20 (2013) 
 
Gag-Pol polyprotein
Name:Gag-Pol polyprotein
Type:Protein
Mol. Mass.:161820.05
Organism:Human immunodeficiency virus type 1 group M subtype B (isolate NY5) (HIV-1)
Description:P12497
Residue:1435
BDBM188497
NameBDBM188497
Synonyms:2-(6-bromo-4-(4-chlorophenyl)-2-methylquinolin-3-yl)-2-(tert-butoxy)acetic acid | ALLINI-2
TypeSmall organic molecule
Emp. Form.C22H21BrClNO3
Mol. Mass.462.764
SMILESCc1nc2ccc(Br)cc2c(-c2ccc(Cl)cc2)c1C(OC(C)(C)C)C(O)=O