Reaction Details
TargetTyrosyl-DNA phosphodiesterase 2 [E242G,S244A,Q278R,I281T,K282R,R316G,P318T,Y321CH323L]
LigandBDBM50438865
Substrate/Competitorn/a
Meas. Tech.Recombinant TDP2 Assay
pH7.5±n/a
IC50 260±n/a nM
Commentsextracted
Citation Marchand, CAbdelmalak, MKankanala, JHuang, SYKiselev, EFesen, KKurahashi, KSasanuma, HTakeda, SAihara, HWang, ZPommier, Y Deazaflavin Inhibitors of Tyrosyl-DNA Phosphodiesterase 2 (TDP2) Specific for the Human Enzyme and Active against Cellular TDP2. ACS Chem Biol11:1925-33 (2016) 
 
Tyrosyl-DNA phosphodiesterase 2 [E242G,S244A,Q278R,I281T,K282R,R316G,P318T,Y321CH323L]
Name:Tyrosyl-DNA phosphodiesterase 2 [E242G,S244A,Q278R,I281T,K282R,R316G,P318T,Y321CH323L]
Type:Protein
Mol. Mass.:40804.32
Organism:Mus musculus (Mouse)
Description:The mTDP2 9M bears the mutations at residues Q278R, I281T, K282R, P318T, Y321C, E242G, S244A, R316G, and H323L.
Residue:370
BDBM50438865
NameBDBM50438865
Synonyms:2,4-Dioxo-10-phenyl-pyrimido[4,5-b]quinoline-8-carbonitrile (3) | CHEMBL2420506
TypeSmall organic molecule
Emp. Form.C18H10N4O2
Mol. Mass.314.2976
SMILESO=c1nc2n(-c3ccccc3)c3cc(ccc3cc2c(=O)[nH]1)C#N