Reaction Details
TargetMethionine aminopeptidase 2
LigandBDBM188567
Substrate/Competitorn/a
Meas. Tech.Enzymatic Screening Assay
IC50 3.06±n/a nM
Citation Benazet, ADuclos, OGuillo, NLassalle, GMacary, KVin, V Pyrazoloquinolinone derivatives, preparation thereof and therapeutic use thereof US Patent US9169246 Publication Date 10/27/2015
 
Methionine aminopeptidase 2
Name:Methionine aminopeptidase 2
Type:Enzyme
Mol. Mass.:52884.45
Organism:Homo sapiens (Human)
Description:P50579
Residue:478
BDBM188567
NameBDBM188567
Synonyms:US9169246, 66
TypeSmall organic molecule
Emp. Form.C21H19F3N6O
Mol. Mass.428.4104
SMILESFC(F)(F)Cn1c2cc(ccc2c2[nH]ncc2c1=O)-c1ccc(nc1)N1CCNCC1