Reaction Details
TargetMethionine aminopeptidase 2
LigandBDBM188692
Substrate/Competitorn/a
Meas. Tech.Enzymatic Screening Assay
IC50 5.33±n/a nM
Citation Benazet, ADuclos, OGuillo, NLassalle, GMacary, KVin, V Pyrazoloquinolinone derivatives, preparation thereof and therapeutic use thereof US Patent US9169246 Publication Date 10/27/2015
 
Methionine aminopeptidase 2
Name:Methionine aminopeptidase 2
Type:Enzyme
Mol. Mass.:52884.45
Organism:Homo sapiens (Human)
Description:P50579
Residue:478
BDBM188692
NameBDBM188692
Synonyms:US9169246, 234
TypeSmall organic molecule
Emp. Form.C19H15F3N4O3S
Mol. Mass.436.408
SMILESCS(=O)(=O)Nc1ccccc1-c1ccc2c3n[nH]cc3c(=O)n(CC(F)(F)F)c2c1