Reaction Details
TargetProstaglandin D2 receptor 2
LigandBDBM189196
Substrate/Competitorn/a
Meas. Tech.Radioligand Displacement Assay
pH7±n/a
Temperature298.15±n/a K
IC50 0.5±n/a nM
Commentsextracted
Citation Aissaoui, HBoss, CRichard-Bildstein, SSiegrist, R 1-phenyl-substituted heterocyclyl derivatives and their use as prostaglandin D2 receptor modulators US Patent US9169270 Publication Date 10/27/2015
 
Prostaglandin D2 receptor 2
Name:Prostaglandin D2 receptor 2
Type:Enzyme
Mol. Mass.:43295.45
Organism:Homo sapiens (Human)
Description:Q9Y5Y4
Residue:395
BDBM189196
NameBDBM189196
Synonyms:US9169270, 68
TypeSmall organic molecule
Emp. Form.C22H17Cl2FN2O5S
Mol. Mass.511.35
SMILESOC(=O)COc1ccc(Cl)cc1[C@H]1N(CCc2ncsc12)C(=O)OCc1cc(Cl)ccc1F