Reaction Details
TargetDual 3',5'-cyclic-AMP and -GMP phosphodiesterase 11A
LigandBDBM86642
Substrate/Competitorn/a
Meas. Tech.In Vitro Enzyme Assay
IC50 280±n/a nM
Citation Hoffman, CSCeyhan, O Inhibitors of phosphodiesterase 11 (PDE11) US Patent US9173884 Publication Date 11/3/2015
 
Dual 3',5'-cyclic-AMP and -GMP phosphodiesterase 11A
Name:Dual 3',5'-cyclic-AMP and -GMP phosphodiesterase 11A
Type:Enzyme
Mol. Mass.:104751.53
Organism:Homo sapiens (Human)
Description:Q9HCR9
Residue:933
BDBM86642
NameBDBM86642
Synonyms:BC11-38 | US9173884, BC11-38
TypeSmall organic molecule
Emp. Form.C15H16N2OS2
Mol. Mass.304.43
SMILESCCCSc1nc2CCSc2c(=O)n1-c1ccccc1