Reaction Details
TargetDual specificity calcium/calmodulin-dependent 3',5'-cyclic nucleotide phosphodiesterase 1B
LigandBDBM86639
Substrate/Competitorn/a
Meas. Tech.In Vitro Enzyme Assay
IC50>100000±n/a nM
Citation Hoffman, CSCeyhan, O Inhibitors of phosphodiesterase 11 (PDE11) US Patent US9173884 Publication Date 11/3/2015
 
Dual specificity calcium/calmodulin-dependent 3',5'-cyclic nucleotide phosphodiesterase 1B
Name:Dual specificity calcium/calmodulin-dependent 3',5'-cyclic nucleotide phosphodiesterase 1B
Type:Enzyme
Mol. Mass.:61366.51
Organism:Homo sapiens (Human)
Description:n/a
Residue:536
BDBM86639
NameBDBM86639
Synonyms:BC11-15 | US9173884, BC11-15
Typen/a
Emp. Form.C23H24N4OS
Mol. Mass.404.528
SMILESCCN(CC)C(=O)c1cc(nc2n(nc(C)c12)-c1ccccc1C)-c1cccs1