Reaction Details
TargetCytochrome P450 2C9
LigandBDBM50090677
Substrate/Competitorn/a
Meas. Tech.Fluorescent High Throughput P450 Assay
IC50 270±10 nM
Citation Maj, RPattarino, FMura, EBarberis, A Phospholipid drug analogs US Patent US9173935 Publication Date 11/3/2015
 
Cytochrome P450 2C9
Name:Cytochrome P450 2C9
Type:Enzyme
Mol. Mass.:55636.33
Organism:Homo sapiens (Human)
Description:P11712
Residue:490
BDBM50090677
NameBDBM50090677
Synonyms:4-Amino-N-(2-phenyl-2H-pyrazol-3-yl)-benzenesulfonamide CHEMBL1109 Sulfabid US9180183, Sulfaphenazole
TypeSmall organic molecule
Emp. Form.C15H14N4O2S
Mol. Mass.314.362
SMILESNc1ccc(cc1)S(=O)(=O)Nc1ccnn1-c1ccccc1