Reaction Details
TargetThyrotropin subunit beta
LigandBDBM60862
Substrate/Competitorn/a
Meas. Tech.Antagonist Activity Assay
IC50 48±0.0 nM
Citation Karstens, WFConti, PGTimmers, CMPlate, RVan Koppen, CJ TSH receptor antagonizing tetrahydroquinoline compounds US Patent US9174940 Publication Date 11/3/2015
 
Thyrotropin subunit beta
Name:Thyrotropin subunit beta
Type:Enzyme
Mol. Mass.:15628.77
Organism:Bos taurus (Bovine)
Description:P01223
Residue:138
BDBM60862
NameBDBM60862
Synonyms:BDBM189328 | US9174940, 32
Typen/a
Emp. Form.C24H30N2O3
Mol. Mass.394.5066
SMILESCC(=O)N1CCC(C)(C2C=C(NC(=O)OC3CCCC3)C=CC12)c1ccccc1