Reaction Details
TargetGag-Pol polyprotein
LigandBDBM189336
Substrate/Competitorn/a
Meas. Tech.RNase H (RH) Assay
pH7.8±n/a
Temperature310.15±n/a K
IC50 1.00e+5± 2e+3 nM
Commentsextracted
Citation Tintori, CCorona, AEsposito, FBrai, AGrandi, NCeresola, ERClementi, MCanducci, FTramontano, EBotta, M Inhibition of HIV-1 Reverse Transcriptase Dimerization by Small Molecules. Chembiochem17:683-8 (2016) 
 
Gag-Pol polyprotein
Name:Gag-Pol polyprotein
Type:Protein
Mol. Mass.:161820.05
Organism:Human immunodeficiency virus type 1 group M subtype B (isolate NY5) (HIV-1)
Description:P12497
Residue:1435
BDBM189336
NameBDBM189336
Synonyms:MAS0 (1)
TypeSmall organic molecule
Emp. Form.C16H17N5O4
Mol. Mass.343.3373
SMILESCn1c2nc3N(CC(O)Cn3c2c(=O)n(C)c1=O)c1ccc(O)cc1