Reaction Details
TargetGag-Pol polyprotein
LigandBDBM60932
Substrate/Competitorn/a
Meas. Tech.RNase H (RH) Assay
pH7.8±n/a
Temperature310.15±n/a K
IC50 9.7e+4± 4e+3 nM
Commentsextracted
Citation Tintori, CCorona, AEsposito, FBrai, AGrandi, NCeresola, ERClementi, MCanducci, FTramontano, EBotta, M Inhibition of HIV-1 Reverse Transcriptase Dimerization by Small Molecules. Chembiochem17:683-8 (2016) 
 
Gag-Pol polyprotein
Name:Gag-Pol polyprotein
Type:Protein
Mol. Mass.:161820.05
Organism:Human immunodeficiency virus type 1 group M subtype B (isolate NY5) (HIV-1)
Description:P12497
Residue:1435
BDBM60932
NameBDBM60932
Synonyms:STOCK4S-37006 (4)
Typen/a
Emp. Form.C22H29N5O3
Mol. Mass.411.4974
SMILESCCCCCn1c(=O)n(C)c2nc3N(CC(C)Cn3c2c1=O)c1ccc(OC)cc1