Reaction Details
TargetGag-Pol polyprotein
LigandBDBM189340
Substrate/Competitorn/a
Meas. Tech.RNA-dependent DNA Polymerase (RDDP) Assay
pH8.1±n/a
Temperature310.15±n/a K
IC50>1.00e+5±n/a nM
Commentsextracted
Citation Tintori, CCorona, AEsposito, FBrai, AGrandi, NCeresola, ERClementi, MCanducci, FTramontano, EBotta, M Inhibition of HIV-1 Reverse Transcriptase Dimerization by Small Molecules. Chembiochem17:683-8 (2016) 
 
Gag-Pol polyprotein
Name:Gag-Pol polyprotein
Type:Protein
Mol. Mass.:161820.05
Organism:Human immunodeficiency virus type 1 group M subtype B (isolate NY5) (HIV-1)
Description:P12497
Residue:1435
BDBM189340
NameBDBM189340
Synonyms:STOCK5S-55040 (5)
TypeSmall organic molecule
Emp. Form.C19H22N6O5
Mol. Mass.414.4152
SMILESCCOc1ccc(cc1)N1CC(O)Cn2c1nc1n(C)c(=O)n(CC(N)=O)c(=O)c21