Reaction Details
TargetGag-Pol polyprotein
LigandBDBM2483
Substrate/Competitorn/a
Meas. Tech.RNA-dependent DNA Polymerase (RDDP) Assay
pH8.1±n/a
Temperature310.15±n/a K
IC50 20± 5 nM
Commentsextracted
Citation Tintori, CCorona, AEsposito, FBrai, AGrandi, NCeresola, ERClementi, MCanducci, FTramontano, EBotta, M Inhibition of HIV-1 Reverse Transcriptase Dimerization by Small Molecules. Chembiochem17:683-8 (2016) 
 
Gag-Pol polyprotein
Name:Gag-Pol polyprotein
Type:Protein
Mol. Mass.:161820.05
Organism:Human immunodeficiency virus type 1 group M subtype B (isolate NY5) (HIV-1)
Description:P12497
Residue:1435
BDBM2483
NameBDBM2483
Synonyms:(4S)-6-chloro-4-(2-cyclopropylethynyl)-4-(trifluoromethyl)-2,4-dihydro-1H-3,1-benzoxazin-2-one DMP-266 Efavirenz L-743,726 | Sustiva
TypeSmall organic molecule
Emp. Form.C14H9ClF3NO2
Mol. Mass.315.675
SMILESFC(F)(F)[C@]1(OC(=O)Nc2ccc(Cl)cc12)C#CC1CC1