Reaction Details
TargetGag-Pol polyprotein
LigandBDBM1434
Substrate/Competitorn/a
Meas. Tech.HIV-1 RT Inhibition Assay
Temperature310.15±n/a K
IC50 6.9e+2±n/a nM
Commentsextracted
Citation Li, XHuang, BZhou, ZGao, PPannecouque, CDaelemans, DDe Clercq, EZhan, PLiu, X Arylazolyl(azinyl)thioacetanilides: Part 19: Discovery of Novel Substituted Imidazo[4,5-b]pyridin-2-ylthioacetanilides as Potent HIV NNRTIs Via a Structure-based Bioisosterism Approach. Chem Biol Drug Des88:241-53 (2016) 
 
Gag-Pol polyprotein
Name:Gag-Pol polyprotein
Type:Protein
Mol. Mass.:161820.05
Organism:Human immunodeficiency virus type 1 group M subtype B (isolate NY5) (HIV-1)
Description:P12497
Residue:1435
BDBM1434
NameBDBM1434
Synonyms:11-cyclopropyl-5,11-dihydro-4-methyl-6H-dipyrido[3,2-b:2 ,3 -e][1,4]diazepin-6-one BI-RG-587 Nevirapine US11420959, Example NVP | Viramune
TypeSmall organic molecule
Emp. Form.C15H14N4O
Mol. Mass.266.2979
SMILESCc1ccnc2N(C3CC3)c3ncccc3C(=O)Nc12