Reaction Details
TargetSerum paraoxonase/arylesterase 1
LigandBDBM50127140
Substrate/Competitorn/a
Meas. Tech.Paraoxonase Activity Assay
pH10.5±n/a
Ki 1.31e+5± 7.1e+4 nM
IC50 2.26e+5±n/a nM
Commentsextracted
Citation Alim, ZBeydemir, S Some Anticancer Agents Act on Human Serum Paraoxonase-1 to Reduce Its Activity. Chem Biol Drug Des88:188-96 (2016) 
 
Serum paraoxonase/arylesterase 1
Name:Serum paraoxonase/arylesterase 1
Type:Enzyme
Mol. Mass.:39719.73
Organism:Homo sapiens (Human)
Description:P27169
Residue:355
BDBM50127140
NameBDBM50127140
Synonyms:(-)-etoposide 4'-Demethylepipodophyllotoxin 9-(4,6-O-(R)-ethylidene-beta-D-glucopyranoside) 9-((4,6-O-Ethylidine-beta-D-glucopyranosyl)oxy)-5,8,8a,9-tetrahydro-5-(4-hydroxy-3,4-dimethyloxyphenyl)furo(3',4'':6,7)naptho-(2,3-d)-1,3-dioxol-6(5aH)-one Etoposide (ET) VP-16 | etoposide
TypeSmall organic molecule
Emp. Form.C29H32O13
Mol. Mass.588.5566
SMILESCOc1cc(cc(OC)c1O)[C@H]1[C@@H]2[C@H](COC2=O)[C@H](O[C@@H]2O[C@@H]3CO[C@@H](C)O[C@H]3[C@H](O)[C@H]2O)c2cc3OCOc3cc12