Reaction Details
TargetAcetylcholinesterase
LigandBDBM189364
Substrate/Competitorn/a
Meas. Tech.AChE Inhibitory Assay
pH7.7±n/a
IC50 83±3.2 nM
Commentsextracted
Citation Shaik, JBPalaka, BKPenumala, MEadlapalli, SDarla Mark, MAmpasala, DRVadde, RAmooru Gangaiah, D Synthesis, Biological Evaluation, and Molecular Docking of 8-imino-2-oxo-2H,8H-pyrano[2,3-f]chromene Analogs: New Dual AChE Inhibitors as Potential Drugs for the Treatment of Alzheimer's Disease. Chem Biol Drug Des88:43-53 (2016) 
 
Acetylcholinesterase
Name:Acetylcholinesterase
Type:Enzyme
Mol. Mass.:71812.79
Organism:Electrophorus electricus (Electric eel)
Description:n/a
Residue:633
BDBM189364
NameBDBM189364
Synonyms:N-dodecyl-8-imino-2-oxo-2H,8H-pyrano[2,3-f]chromene-9-carboxamide (4c)
TypeSmall organic molecule
Emp. Form.C25H32N2O4
Mol. Mass.424.5326
(=O)c1cc2c(ccc3ccc(=O)oc23)oc1=N