Reaction Details
TargetAcetylcholinesterase
LigandBDBM189369
Substrate/Competitorn/a
Meas. Tech.AChE Inhibitory Assay
pH7.7±n/a
IC50 462±36.03 nM
Commentsextracted
Citation Shaik, JBPalaka, BKPenumala, MEadlapalli, SDarla Mark, MAmpasala, DRVadde, RAmooru Gangaiah, D Synthesis, Biological Evaluation, and Molecular Docking of 8-imino-2-oxo-2H,8H-pyrano[2,3-f]chromene Analogs: New Dual AChE Inhibitors as Potential Drugs for the Treatment of Alzheimer's Disease. Chem Biol Drug Des88:43-53 (2016) 
 
Acetylcholinesterase
Name:Acetylcholinesterase
Type:Enzyme
Mol. Mass.:71812.79
Organism:Electrophorus electricus (Electric eel)
Description:n/a
Residue:633
BDBM189369
NameBDBM189369
Synonyms:8-imino-2-oxo-N-(1-phenylethyl)-2H,8H-pyrano[2,3-f]chromene-9-carboxamide (4h)
TypeSmall organic molecule
Emp. Form.C21H16N2O4
Mol. Mass.360.3627
SMILESCC(NC(=O)c1cc2c(ccc3ccc(=O)oc23)oc1=N)c1ccccc1