Reaction Details
TargetAcetylcholinesterase
LigandBDBM189374
Substrate/Competitorn/a
Meas. Tech.AChE Inhibitory Assay
pH7.7±n/a
IC50 13±1.4 nM
Commentsextracted
Citation Shaik, JBPalaka, BKPenumala, MEadlapalli, SDarla Mark, MAmpasala, DRVadde, RAmooru Gangaiah, D Synthesis, Biological Evaluation, and Molecular Docking of 8-imino-2-oxo-2H,8H-pyrano[2,3-f]chromene Analogs: New Dual AChE Inhibitors as Potential Drugs for the Treatment of Alzheimer's Disease. Chem Biol Drug Des88:43-53 (2016) 
 
Acetylcholinesterase
Name:Acetylcholinesterase
Type:Enzyme
Mol. Mass.:71812.79
Organism:Electrophorus electricus (Electric eel)
Description:n/a
Residue:633
BDBM189374
NameBDBM189374
Synonyms:N-(3-bromobenzyl)-8-imino-2-oxo-2H,8H-pyrano[2,3-f]chromene-9-carboxamide (4m)
TypeSmall organic molecule
Emp. Form.C20H13BrN2O4
Mol. Mass.425.232
SMILESBrc1cccc(CNC(=O)c2cc3c(ccc4ccc(=O)oc34)oc2=N)c1