Reaction Details
TargetCoagulation factor VII
LigandBDBM189419
Substrate/Competitorn/a
Meas. Tech.In Vitro Assay
Ki 2.2±n/a nM
Citation Zhang, XGlunz, PPriestley, ESJohnson, JAWurtz, NRLadziata, V Macrocyclic factor VIIa inhibitors US Patent US9174974 Publication Date 11/3/2015
 
Coagulation factor VII
Name:Coagulation factor VII
Type:Enzyme
Mol. Mass.:51599.89
Organism:Homo sapiens (Human)
Description:n/a
Residue:466
BDBM189419
NameBDBM189419
Synonyms:US9174974, Example 4
TypeSmall organic molecule
Emp. Form.C37H37F2N7O4S
Mol. Mass.713.796
SMILESCCN(Cc1nccs1)C(=O)c1ccc2NC(=O)OCC(F)(F)c3c(C)cc(cc3C)[C@@H](Nc3ccc4c(N)nccc4c3)C(=O)N(C)Cc1c2