Reaction Details
TargetCoagulation factor VII
LigandBDBM189435
Substrate/Competitorn/a
Meas. Tech.In Vitro Assay
Ki 0.36±n/a nM
Citation Zhang, XGlunz, PPriestley, ESJohnson, JAWurtz, NRLadziata, V Macrocyclic factor VIIa inhibitors US Patent US9174974 Publication Date 11/3/2015
 
Coagulation factor VII
Name:Coagulation factor VII
Type:Enzyme
Mol. Mass.:51599.89
Organism:Homo sapiens (Human)
Description:n/a
Residue:466
BDBM189435
NameBDBM189435
Synonyms:US9174974, Example 20
TypeSmall organic molecule
Emp. Form.C33H35F2N5O5S
Mol. Mass.651.723
SMILESCC(C)S(=O)(=O)c1c(F)cc2NC(=O)OC[C@H](C)c3ccc(cc3C)[C@@H](Nc3cc(F)c4c(N)nccc4c3)C(=O)N(C)Cc1c2