Reaction Details
TargetCoagulation factor VII
LigandBDBM189452
Substrate/Competitorn/a
Meas. Tech.In Vitro Assay
Ki 0.2±n/a nM
Citation Zhang, XGlunz, PPriestley, ESJohnson, JAWurtz, NRLadziata, V Macrocyclic factor VIIa inhibitors US Patent US9174974 Publication Date 11/3/2015
 
Coagulation factor VII
Name:Coagulation factor VII
Type:Enzyme
Mol. Mass.:51599.89
Organism:Homo sapiens (Human)
Description:n/a
Residue:466
BDBM189452
NameBDBM189452
Synonyms:US9174974, Example 28
TypeSmall organic molecule
Emp. Form.C34H38FN5O5
Mol. Mass.615.6944
SMILESCOCCCOc1c(F)cc2NC(=O)OC[C@H](C)c3ccc(cc3C)[C@@H](Nc3ccc4c(N)nccc4c3)C(=O)N(C)Cc1c2