Reaction Details
TargetCoagulation factor VII
LigandBDBM189444
Substrate/Competitorn/a
Meas. Tech.In Vitro Assay
Ki 0.17±n/a nM
Citation Zhang, XGlunz, PPriestley, ESJohnson, JAWurtz, NRLadziata, V Macrocyclic factor VIIa inhibitors US Patent US9174974 Publication Date 11/3/2015
 
Coagulation factor VII
Name:Coagulation factor VII
Type:Enzyme
Mol. Mass.:51599.89
Organism:Homo sapiens (Human)
Description:n/a
Residue:466
BDBM189444
NameBDBM189444
Synonyms:US9174974, Example 30
TypeSmall organic molecule
Emp. Form.C33H36FN5O5
Mol. Mass.601.6678
SMILESC[C@H](CO)Oc1c(F)cc2NC(=O)OC[C@H](C)c3ccc(cc3C)[C@@H](Nc3ccc4c(N)nccc4c3)C(=O)N(C)Cc1c2