Reaction Details
TargetCoagulation factor VII
LigandBDBM189450
Substrate/Competitorn/a
Meas. Tech.In Vitro Assay
Ki 0.12±n/a nM
Citation Zhang, XGlunz, PPriestley, ESJohnson, JAWurtz, NRLadziata, V Macrocyclic factor VIIa inhibitors US Patent US9174974 Publication Date 11/3/2015
 
Coagulation factor VII
Name:Coagulation factor VII
Type:Enzyme
Mol. Mass.:51599.89
Organism:Homo sapiens (Human)
Description:n/a
Residue:466
BDBM189450
NameBDBM189450
Synonyms:US9174974, Example 36
TypeSmall organic molecule
Emp. Form.C34H35N9O3
Mol. Mass.617.7002
SMILESC[C@H]1COC(=O)Nc2ccc(c(CN(C)C(=O)[C@H](Nc3ccc4c(N)nccc4c3)c3ccc1c(C)c3)c2)C1(CC1)c1nnn[nH]1