Reaction Details
TargetCoagulation factor VII
LigandBDBM189432
Substrate/Competitorn/a
Meas. Tech.In Vitro Assay
pH7.4±n/a
Ki 400±n/a nM
Commentsextracted
Citation Zhang, XGlunz, PPriestley, ESJohnson, JAWurtz, NRLadziata, V Macrocyclic factor VIIa inhibitors US Patent US9174974 Publication Date 11/3/2015
 
Coagulation factor VII
Name:Coagulation factor VII
Type:Enzyme
Mol. Mass.:51599.89
Organism:Homo sapiens (Human)
Description:n/a
Residue:466
BDBM189432
NameBDBM189432
Synonyms:US9174974, Example 17
TypeSmall organic molecule
Emp. Form.C33H36FN5O5
Mol. Mass.601.6678
SMILESC[C@H](O)COc1c(F)cc2NC(=O)OC[C@H](C)c3ccc(cc3C)[C@@H](Nc3ccc4c(N)nccc4c3)C(=O)N(C)Cc1c2