Reaction Details
TargetCoagulation factor VII
LigandBDBM189451
Substrate/Competitorn/a
Meas. Tech.In Vitro Assay
pH7.4±n/a
Ki 100±n/a nM
Commentsextracted
Citation Zhang, XGlunz, PPriestley, ESJohnson, JAWurtz, NRLadziata, V Macrocyclic factor VIIa inhibitors US Patent US9174974 Publication Date 11/3/2015
 
Coagulation factor VII
Name:Coagulation factor VII
Type:Enzyme
Mol. Mass.:51599.89
Organism:Homo sapiens (Human)
Description:n/a
Residue:466
BDBM189451
NameBDBM189451
Synonyms:US9174974, Example 39
TypeSmall organic molecule
Emp. Form.C34H36FN5O5
Mol. Mass.613.6785
SMILESC[C@H]1COC(=O)Nc2cc(F)c(O[C@H]3CCOC3)c(CN(C)C(=O)C(Nc3ccc4c(N)nccc4c3)c3ccc1c(C)c3)c2