Reaction Details
TargetReceptor-interacting serine/threonine-protein kinase 1
LigandBDBM288689
Substrate/Competitorn/a
Meas. Tech.Kinase Assay of RIPK1
Temperature298.15±n/a K
Ki 13.7±n/a nM
Commentsextracted
Citation Zhang, ZWang, XSu, YRuan, HRen, Y Necrosis inhibitors US Patent US10092529 Publication Date 10/9/2018
 
Receptor-interacting serine/threonine-protein kinase 1
Name:Receptor-interacting serine/threonine-protein kinase 1
Type:Enzyme Catalytic Domain
Mol. Mass.:75926.99
Organism:Homo sapiens (Human)
Description:Q13546
Residue:671
BDBM288689
NameBDBM288689
Synonyms:TC001262 | US10092529, Compound 38
TypeSmall organic molecule
Emp. Form.C15H17NO2
Mol. Mass.243.301
SMILESCC(C)(C=C)C(=O)N1[C@@H](CC1=O)c1ccccc1