Reaction Details
TargetApoptosis regulator Bcl-2
LigandBDBM189541
Substrate/Competitorn/a
Meas. Tech.Time Resolved-Fluorescence Resonance Energy Transfer (TR-FRET) Assay
Temperature298.15±n/a K
Ki<0.01±n/a nM
Commentsextracted
Citation Bruncko, MDing, HDoherty, GAElmore, SWHasvold, LAHexamer, LKunzer, ARSong, XSouers, AJSullivan, GMTao, ZWang, GTWang, LWang, XWendt, MDMantei, RAHansen, TM Apoptosis-inducing agents for the treatment of cancer and immune and autoimmune diseases US Patent US9174982 Publication Date 11/3/2015
 
Apoptosis regulator Bcl-2
Name:Apoptosis regulator Bcl-2
Type:Homodimer or heterodimer
Mol. Mass.:26269.11
Organism:Homo sapiens (Human)
Description:P10415
Residue:239
BDBM189541
NameBDBM189541
Synonyms:US10213433, Compound 103 US9174982, 103
TypeSmall organic molecule
Emp. Form.C46H52ClN7O8S
Mol. Mass.898.465
SMILESCCN1CCOCC1COc1ccc(cc1[N+]([O-])=O)S(=O)(=O)NC(=O)c1ccc(cc1Oc1cnc2[nH]ccc2c1)N1CCN(CC2=C(CC(C)(C)CC2)c2ccc(Cl)cc2)CC1