Reaction Details
TargetApoptosis regulator Bcl-2
LigandBDBM189755
Substrate/Competitorn/a
Meas. Tech.Time Resolved-Fluorescence Resonance Energy Transfer (TR-FRET) Assay
Temperature298.15±n/a K
Ki<0.01±n/a nM
Commentsextracted
Citation Bruncko, MDing, HDoherty, GAElmore, SWHasvold, LAHexamer, LKunzer, ARSong, XSouers, AJSullivan, GMTao, ZWang, GTWang, LWang, XWendt, MDMantei, RAHansen, TM Apoptosis-inducing agents for the treatment of cancer and immune and autoimmune diseases US Patent US9174982 Publication Date 11/3/2015
 
Apoptosis regulator Bcl-2
Name:Apoptosis regulator Bcl-2
Type:Homodimer or heterodimer
Mol. Mass.:26269.11
Organism:Homo sapiens (Human)
Description:P10415
Residue:239
BDBM189755
NameBDBM189755
Synonyms:US10213433, Compound 325 US9174982, 325
TypeSmall organic molecule
Emp. Form.C50H55Cl2FN6O7S
Mol. Mass.973.977
SMILESFC1(COc2ccc(cc2Cl)S(=O)(=O)NC(=O)c2ccc(cc2Oc2cnc3[nH]ccc3c2)N2CCN(CC3=C(CCC4(CCN(CC4)C4COC4)C3)c3ccc(Cl)cc3)CC2)CCOCC1