Reaction Details
TargetSerine/threonine-protein kinase Sgk1
LigandBDBM50043874
Substrate/Competitorn/a
Meas. Tech.Enzymatic Activity Assay
IC50 3±n/a nM
Citation Nazare, MHalland, NSchmidt, FWeiss, TDietz, UHofmeister, A N-[4-(1H-pyrazolo[3,4-b]pyrazin-6-yl)-phenyl]-sulfonamides and their use as pharmaceuticals US Patent US9174993 Publication Date 11/3/2015
 
Serine/threonine-protein kinase Sgk1
Name:Serine/threonine-protein kinase Sgk1
Type:Other Protein Type
Mol. Mass.:48954.40
Organism:Homo sapiens (Human)
Description:Recombinant human SGK-1 enzyme produced in a baculovirus system.
Residue:431
BDBM50043874
NameBDBM50043874
Synonyms:CHEMBL3356060 US9221828, 13
TypeSmall organic molecule
Emp. Form.C19H13ClN6O2S
Mol. Mass.424.864
SMILESCc1n[nH]c2nc(cnc12)-c1ccc(NS(=O)(=O)c2cc(Cl)ccc2C#N)cc1