Reaction Details
TargetHistone-lysine N-methyltransferase EZH2
LigandBDBM190200
Substrate/Competitorn/a
Meas. Tech.Inhibition Assay
IC50 6.5±n/a nM
Citation Kuntz, KWKnutson, SKWigle, TJ Inhibitors of human EZH2, and methods of use thereof US Patent US9175331 Publication Date 11/3/2015
 
Histone-lysine N-methyltransferase EZH2
Name:Histone-lysine N-methyltransferase EZH2
Type:Protein
Mol. Mass.:85367.84
Organism:Homo sapiens (Human)
Description:Q15910
Residue:746
BDBM190200
NameBDBM190200
Synonyms:EPZ008335 | US9175331, 30
TypeSmall organic molecule
Emp. Form.C27H39ClN4O2
Mol. Mass.487.077
SMILESCCN([C@H]1CC[C@@H](CC1)N(C)C)c1cc(Cl)cc(C(=O)NCc2c(C)cc(C)[nH]c2=O)c1CC