Reaction Details
TargetHistone-lysine N-methyltransferase EZH2 [Y641F]
LigandBDBM190211
Substrate/Competitorn/a
Meas. Tech.Inhibition Assay
IC50 6.7±n/a nM
Citation Kuntz, KWKnutson, SKWigle, TJ Inhibitors of human EZH2, and methods of use thereof US Patent US9175331 Publication Date 11/3/2015
 
Histone-lysine N-methyltransferase EZH2 [Y641F]
Name:Histone-lysine N-methyltransferase EZH2 [Y641F]
Type:n/a
Mol. Mass.:85351.84
Organism:Homo sapiens (Human)
Description:Q15910[Y641F]
Residue:746
BDBM190211
NameBDBM190211
Synonyms:EPZ008990 | US9175331, 47
TypeSmall organic molecule
Emp. Form.C28H39ClN4O3
Mol. Mass.515.087
SMILESCCN([C@H]1CC[C@@H](CC1)N(C)C1COC1)c1cc(Cl)cc(C(=O)NCc2c(C)cc(C)[nH]c2=O)c1C