Reaction Details
TargetHistone-lysine N-methyltransferase EZH2 [A677G]
LigandBDBM190198
Substrate/Competitorn/a
Meas. Tech.Inhibition Assay
IC50 2.2±n/a nM
Citation Kuntz, KWKnutson, SKWigle, TJ Inhibitors of human EZH2, and methods of use thereof US Patent US9175331 Publication Date 11/3/2015
 
Histone-lysine N-methyltransferase EZH2 [A677G]
Name:Histone-lysine N-methyltransferase EZH2 [A677G]
Type:Protein
Mol. Mass.:85381.87
Organism:Homo sapiens (Human)
Description:Q15910[A677G]
Residue:746
BDBM190198
NameBDBM190198
Synonyms:EPZ008279 | US9175331, 27
TypeSmall organic molecule
Emp. Form.C24H32ClN3O3
Mol. Mass.445.982
SMILESCCN(C1CCOCC1)c1cc(Cl)cc(C(=O)NCc2c(C)cc(CC)[nH]c2=O)c1C