Reaction Details
TargetHistone-lysine N-methyltransferase EZH2 [A687V]
LigandBDBM190182
Substrate/Competitorn/a
Meas. Tech.Inhibition Assay
IC50 27.7±n/a nM
Citation Kuntz, KWKnutson, SKWigle, TJ Inhibitors of human EZH2, and methods of use thereof US Patent US9175331 Publication Date 11/3/2015
 
Histone-lysine N-methyltransferase EZH2 [A687V]
Name:Histone-lysine N-methyltransferase EZH2 [A687V]
Type:Protein
Mol. Mass.:85395.90
Organism:Homo sapiens (Human)
Description:Q15910[A687V]
Residue:746
BDBM190182
NameBDBM190182
Synonyms:EPZ006089 | US9175331, 8
TypeSmall organic molecule
Emp. Form.C31H44N4O2
Mol. Mass.504.7067
SMILESCN(C1CCCC1)c1cc(cc(C(=O)NCc2c(C)cc(C)[nH]c2=O)c1C)C1=CC(C)(C)NC(C)(C)C1