Reaction Details
TargetHistone-lysine N-methyltransferase EZH2 [A687V]
LigandBDBM190183
Substrate/Competitorn/a
Meas. Tech.Inhibition Assay
IC50 1.5±n/a nM
Citation Kuntz, KWKnutson, SKWigle, TJ Inhibitors of human EZH2, and methods of use thereof US Patent US9175331 Publication Date 11/3/2015
 
Histone-lysine N-methyltransferase EZH2 [A687V]
Name:Histone-lysine N-methyltransferase EZH2 [A687V]
Type:Protein
Mol. Mass.:85395.90
Organism:Homo sapiens (Human)
Description:Q15910[A687V]
Residue:746
BDBM190183
NameBDBM190183
Synonyms:EPZ006438 US9175331, 9
TypeSmall organic molecule
Emp. Form.C34H43N4O4
Mol. Mass.571.7296
SMILESCCN(C1CCOCC1)c1cc(cc(C(=O)NCc2c(C)cc(C)nc2=O)c1C)-c1ccc(CN2CCOCC2)cc1