Reaction Details
TargetHistone-lysine N-methyltransferase EZH2 [A687V]
LigandBDBM190187
Substrate/Competitorn/a
Meas. Tech.Inhibition Assay
IC50 12.8±n/a nM
Citation Kuntz, KWKnutson, SKWigle, TJ Inhibitors of human EZH2, and methods of use thereof US Patent US9175331 Publication Date 11/3/2015
 
Histone-lysine N-methyltransferase EZH2 [A687V]
Name:Histone-lysine N-methyltransferase EZH2 [A687V]
Type:Protein
Mol. Mass.:85395.90
Organism:Homo sapiens (Human)
Description:Q15910[A687V]
Residue:746
BDBM190187
NameBDBM190187
Synonyms:EPZ007227 | US9175331, 14
TypeSmall organic molecule
Emp. Form.C27H39ClN4O2
Mol. Mass.487.077
SMILESCCN([C@H]1CC[C@@H](CC1)N(C)C)c1cc(Cl)cc(C(=O)N(C)Cc2c(C)cc(C)[nH]c2=O)c1C