Reaction Details
TargetHistone-lysine N-methyltransferase EZH2 [A687V]
LigandBDBM172166
Substrate/Competitorn/a
Meas. Tech.Inhibition Assay
IC50 3.9±n/a nM
Citation Kuntz, KWKnutson, SKWigle, TJ Inhibitors of human EZH2, and methods of use thereof US Patent US9175331 Publication Date 11/3/2015
 
Histone-lysine N-methyltransferase EZH2 [A687V]
Name:Histone-lysine N-methyltransferase EZH2 [A687V]
Type:Protein
Mol. Mass.:85395.90
Organism:Homo sapiens (Human)
Description:Q15910[A687V]
Residue:746
BDBM172166
NameBDBM172166
Synonyms:EPZ008280 US11052093, Compound 174 US9175331, 28
TypeSmall organic molecule
Emp. Form.C30H40N6O2
Mol. Mass.516.6776
SMILESCCN([C@H]1CC[C@@H](CC1)N(C)C)c1cc(cc(C(=O)NCc2c(C)cc(C)[nH]c2=O)c1C)-c1cnccn1