Reaction Details
TargetHistone-lysine N-methyltransferase EZH2 [A687V]
LigandBDBM172167
Substrate/Competitorn/a
Meas. Tech.Inhibition Assay
IC50 7.2±n/a nM
Citation Kuntz, KWKnutson, SKWigle, TJ Inhibitors of human EZH2, and methods of use thereof US Patent US9175331 Publication Date 11/3/2015
 
Histone-lysine N-methyltransferase EZH2 [A687V]
Name:Histone-lysine N-methyltransferase EZH2 [A687V]
Type:Protein
Mol. Mass.:85395.90
Organism:Homo sapiens (Human)
Description:Q15910[A687V]
Residue:746
BDBM172167
NameBDBM172167
Synonyms:EPZ008338 US11052093, Compound 175 US9175331, 33
TypeSmall organic molecule
Emp. Form.C31H42N6O2
Mol. Mass.530.7042
SMILESCCN([C@H]1CC[C@@H](CC1)N(C)C)c1cc(cc(C(=O)NCc2c(C)cc(C)[nH]c2=O)c1C)-c1cnc(C)cn1