Reaction Details
TargetHistone-lysine N-methyltransferase EZH2 [A687V]
LigandBDBM190215
Substrate/Competitorn/a
Meas. Tech.Inhibition Assay
IC50 22.7±n/a nM
Citation Kuntz, KWKnutson, SKWigle, TJ Inhibitors of human EZH2, and methods of use thereof US Patent US9175331 Publication Date 11/3/2015
 
Histone-lysine N-methyltransferase EZH2 [A687V]
Name:Histone-lysine N-methyltransferase EZH2 [A687V]
Type:Protein
Mol. Mass.:85395.90
Organism:Homo sapiens (Human)
Description:Q15910[A687V]
Residue:746
BDBM190215
NameBDBM190215
Synonyms:EPZ009090 | US9175331, 51
TypeSmall organic molecule
Emp. Form.C27H38ClN3O2
Mol. Mass.472.063
SMILESCCN(C1CCC(CC1)C(C)C)c1cc(Cl)cc(C(=O)NCc2c(C)cc(C)[nH]c2=O)c1C