Reaction Details
TargetHistone-lysine N-methyltransferase EZH2 [A687V]
LigandBDBM190216
Substrate/Competitorn/a
Meas. Tech.Inhibition Assay
IC50 22.2±n/a nM
Citation Kuntz, KWKnutson, SKWigle, TJ Inhibitors of human EZH2, and methods of use thereof US Patent US9175331 Publication Date 11/3/2015
 
Histone-lysine N-methyltransferase EZH2 [A687V]
Name:Histone-lysine N-methyltransferase EZH2 [A687V]
Type:Protein
Mol. Mass.:85395.90
Organism:Homo sapiens (Human)
Description:Q15910[A687V]
Residue:746
BDBM190216
NameBDBM190216
Synonyms:EPZ009099 | US9175331, 53
TypeSmall organic molecule
Emp. Form.C22H29ClN4O2
Mol. Mass.416.944
SMILESCCN(C1CN(C)C1)c1cc(Cl)cc(C(=O)NCc2c(C)cc(C)[nH]c2=O)c1C