Reaction Details
TargetProstaglandin E2 receptor EP4 subtype
LigandBDBM190267
Substrate/Competitorn/a
Meas. Tech.Radioligand Binding Assay
pH6±n/a
Ki 0.44±n/a nM
IC50 1.2±n/a nM
Commentsextracted
Citation Barrett, SDCiske, FLColombo, JMEndres, GWGermain, BDKornilov, AKramer, JBUzieblo, AMaxey, KM Difluorolactam compounds as EP4 receptor-selective agonists for use in the treatment of EP4-mediated diseases and conditions US Patent US9180116 Publication Date 11/10/2015
 
Prostaglandin E2 receptor EP4 subtype
Name:Prostaglandin E2 receptor EP4 subtype
Type:Enzyme
Mol. Mass.:53134.53
Organism:Homo sapiens (Human)
Description:P35408
Residue:488
BDBM190267
NameBDBM190267
Synonyms:US9180116, 1F
TypeSmall organic molecule
Emp. Form.C20H29F2NO4
Mol. Mass.385.4454
SMILESCC#CC[C@H](C)[C@H](O)\C=C\[C@H]1CC(F)(F)C(=O)N1CCCCCCC(O)=O