Reaction Details
TargetProstaglandin E2 receptor EP4 subtype
LigandBDBM190272
Substrate/Competitorn/a
Meas. Tech.Radioligand Binding Assay
pH6±n/a
Ki 0.12±n/a nM
IC50 0.32±n/a nM
Commentsextracted
Citation Barrett, SDCiske, FLColombo, JMEndres, GWGermain, BDKornilov, AKramer, JBUzieblo, AMaxey, KM Difluorolactam compounds as EP4 receptor-selective agonists for use in the treatment of EP4-mediated diseases and conditions US Patent US9180116 Publication Date 11/10/2015
 
Prostaglandin E2 receptor EP4 subtype
Name:Prostaglandin E2 receptor EP4 subtype
Type:Enzyme
Mol. Mass.:53134.53
Organism:Homo sapiens (Human)
Description:P35408
Residue:488
BDBM190272
NameBDBM190272
Synonyms:US9180116, 12D
TypeSmall organic molecule
Emp. Form.C23H27F2NO4
Mol. Mass.419.4616
SMILESCCC#CC[C@H](C)[C@H](O)\C=C\[C@H]1CC(F)(F)C(=O)N1CCc1ccc(cc1)C(O)=O