Reaction Details
TargetCytochrome P450 3A5
LigandBDBM190404
Substrate/CompetitorUS9180183, BFC
Meas. Tech.Fluorescent High Throughput P450 Assays
Temperature310.15±n/a K
IC50 10500±500 nM
Commentsextracted
Citation Maj, RPattarino, FMura, EBarberis, A Phospholipid drug analogs US Patent US9180183 Publication Date 11/10/2015
 
Cytochrome P450 3A5
Name:Cytochrome P450 3A5
Type:Protein
Mol. Mass.:57118.00
Organism:Homo sapiens (Human)
Description:P20815
Residue:502
BDBM190404
US9180183, BFC
NameBDBM190404
Synonyms:US9180183, SC12
TypeSmall organic molecule
Emp. Form.C45H73N6O12P
Mol. Mass.921.0679
SMILESCCCCCCCCCCCC(=O)OCC(COP(O)(=O)OCCNC(=O)c1ccc(Cn2c3nc(OCCOC)nc(N)c3[nH]c2=O)cc1)OC(=O)CCCCCCCCCCC