Reaction Details
TargetAurora kinase A
LigandBDBM155566
Substrate/Competitorn/a
Meas. Tech.Aurora A Inhibition Assay
pH7.4±n/a
Temperature298.15±n/a K
IC50 0.500±n/a nM
Commentsextracted
Citation Sugimoto, TTakahashi, HMitsuya, MMasuko, NSootome, H Piperidine compound or salt thereof US Patent US10092556 Publication Date 10/9/2018
 
Aurora kinase A
Name:Aurora kinase A
Type:Serine/threonine-protein kinase
Mol. Mass.:45830.98
Organism:Homo sapiens (Human)
Description:O14965
Residue:403
BDBM155566
NameBDBM155566
Synonyms:US10092556, Example 2 US9346787, 2
TypeSmall organic molecule
Emp. Form.C24H22F5N5O3
Mol. Mass.523.4552
SMILESCc1cc(Nc2nc(CC3(CCN(CC3)C(=O)c3cccc(c3F)C(F)(F)F)C(O)=O)ccc2F)n[nH]1