Reaction Details
TargetAurora kinase A
LigandBDBM155575
Substrate/Competitorn/a
Meas. Tech.Aurora A Inhibition Assay
pH7.4±n/a
Temperature298.15±n/a K
IC50 0.700±n/a nM
Commentsextracted
Citation Sugimoto, TTakahashi, HMitsuya, MMasuko, NSootome, H Piperidine compound or salt thereof US Patent US10092556 Publication Date 10/9/2018
 
Aurora kinase A
Name:Aurora kinase A
Type:Serine/threonine-protein kinase
Mol. Mass.:45830.98
Organism:Homo sapiens (Human)
Description:O14965
Residue:403
BDBM155575
NameBDBM155575
Synonyms:US10092556, Example 28 US9346787, 28
TypeSmall organic molecule
Emp. Form.C25H24ClF2N7O2
Mol. Mass.527.954
SMILESCc1cc(Nc2nc(CC3(CCN(CC3)C(=O)c3cccc(Cl)c3F)c3nnc(C)o3)ccc2F)n[nH]1