Reaction Details
TargetEnoyl-[acyl-carrier-protein] reductase [NADH]
LigandBDBM16294
Substrate/Competitorn/a
Meas. Tech.Inhibition Kinetics
IC50 2.0e+4± 3e+3 nM
Citation Neckles, CPschibul, ALai, CTHirschbeck, MKuper, JDavoodi, SZou, JLiu, NPan, PShah, SDaryaee, FBommineni, GRLai, CSimmerling, CKisker, CTonge, PJ Selectivity of Pyridone- and Diphenyl Ether-Based Inhibitors for the Yersinia pestis FabV Enoyl-ACP Reductase. Biochemistry55:2992-3006 (2016) 
 
Enoyl-[acyl-carrier-protein] reductase [NADH]
Name:Enoyl-[acyl-carrier-protein] reductase [NADH]
Type:Protein
Mol. Mass.:43335.99
Organism:Yersinia pestis (Enterobacteria)
Description:n/a
Residue:399
BDBM16294
NameBDBM16294
Synonyms:2PP 5-butyl-2-phenoxylphenol AIDS227443 US10071965, Compound PT04
TypeSmall organic molecule
Emp. Form.C14H14O2
Mol. Mass.214.2598
SMILESCCc1ccc(Oc2ccccc2)c(O)c1