Reaction Details
TargetEnoyl-[acyl-carrier-protein] reductase [NADH]
LigandBDBM50373355
Substrate/Competitorn/a
Meas. Tech.Inhibition Kinetics
IC50 1e+3±n/a nM
Citation Neckles, CPschibul, ALai, CTHirschbeck, MKuper, JDavoodi, SZou, JLiu, NPan, PShah, SDaryaee, FBommineni, GRLai, CSimmerling, CKisker, CTonge, PJ Selectivity of Pyridone- and Diphenyl Ether-Based Inhibitors for the Yersinia pestis FabV Enoyl-ACP Reductase. Biochemistry55:2992-3006 (2016) 
 
Enoyl-[acyl-carrier-protein] reductase [NADH]
Name:Enoyl-[acyl-carrier-protein] reductase [NADH]
Type:Protein
Mol. Mass.:43335.99
Organism:Yersinia pestis (Enterobacteria)
Description:n/a
Residue:399
BDBM50373355
NameBDBM50373355
Synonyms:CHEMBL264415 | PT10
TypeSmall organic molecule
Emp. Form.C18H21NO4
Mol. Mass.315.3636
SMILESCCCCCCc1ccc(Oc2ccccc2[N+]([O-])=O)c(O)c1