Reaction Details
TargetEnoyl-[acyl-carrier-protein] reductase [NADH]
LigandBDBM50373347
Substrate/Competitorn/a
Meas. Tech.Inhibition Kinetics
IC50 3e+3±n/a nM
Citation Neckles, CPschibul, ALai, CTHirschbeck, MKuper, JDavoodi, SZou, JLiu, NPan, PShah, SDaryaee, FBommineni, GRLai, CSimmerling, CKisker, CTonge, PJ Selectivity of Pyridone- and Diphenyl Ether-Based Inhibitors for the Yersinia pestis FabV Enoyl-ACP Reductase. Biochemistry55:2992-3006 (2016) 
 
Enoyl-[acyl-carrier-protein] reductase [NADH]
Name:Enoyl-[acyl-carrier-protein] reductase [NADH]
Type:Protein
Mol. Mass.:43335.99
Organism:Yersinia pestis (Enterobacteria)
Description:n/a
Residue:399
BDBM50373347
NameBDBM50373347
Synonyms:CHEMBL264175 | PT15
TypeSmall organic molecule
Emp. Form.C18H23NO2
Mol. Mass.285.3807
SMILESCCCCCCc1ccc(Oc2ccc(N)cc2)c(O)c1