Reaction Details
TargetEnoyl-[acyl-carrier-protein] reductase [NADH] [T276S]
LigandBDBM190657
Substrate/Competitorn/a
Meas. Tech.Inhibition Kinetics
IC50 6e+3± 1e+3 nM
Citation Neckles, CPschibul, ALai, CTHirschbeck, MKuper, JDavoodi, SZou, JLiu, NPan, PShah, SDaryaee, FBommineni, GRLai, CSimmerling, CKisker, CTonge, PJ Selectivity of Pyridone- and Diphenyl Ether-Based Inhibitors for the Yersinia pestis FabV Enoyl-ACP Reductase. Biochemistry55:2992-3006 (2016) 
 
Enoyl-[acyl-carrier-protein] reductase [NADH] [T276S]
Name:Enoyl-[acyl-carrier-protein] reductase [NADH] [T276S]
Type:Protein
Mol. Mass.:43321.97
Organism:Yersinia pestis (Enterobacteria)
Description:B1JRQ0[T276S]
Residue:399
BDBM190657
NameBDBM190657
Synonyms:PT425
TypeSmall organic molecule
Emp. Form.C18H24N2O
Mol. Mass.284.396
SMILESCCCCCCc1ccn(Cc2ccc(N)cc2)c(=O)c1