Reaction Details
TargetEnoyl-[acyl-carrier-protein] reductase [NADH] [T276S]
LigandBDBM190660
Substrate/Competitorn/a
Meas. Tech.Inhibition Kinetics
IC50 3e+2±n/a nM
Citation Neckles, CPschibul, ALai, CTHirschbeck, MKuper, JDavoodi, SZou, JLiu, NPan, PShah, SDaryaee, FBommineni, GRLai, CSimmerling, CKisker, CTonge, PJ Selectivity of Pyridone- and Diphenyl Ether-Based Inhibitors for the Yersinia pestis FabV Enoyl-ACP Reductase. Biochemistry55:2992-3006 (2016) 
 
Enoyl-[acyl-carrier-protein] reductase [NADH] [T276S]
Name:Enoyl-[acyl-carrier-protein] reductase [NADH] [T276S]
Type:Protein
Mol. Mass.:43321.97
Organism:Yersinia pestis (Enterobacteria)
Description:B1JRQ0[T276S]
Residue:399
BDBM190660
NameBDBM190660
Synonyms:PT157
TypeSmall organic molecule
Emp. Form.C18H24N2O2
Mol. Mass.300.3954
SMILESCCCCCCc1cc(=O)c(Oc2ccc(N)cc2)cn1C