Reaction Details
TargetEnoyl-[acyl-carrier-protein] reductase [NADH] [T276S]
LigandBDBM190656
Substrate/Competitorn/a
Meas. Tech.Steady-State Kinetics
pH8±n/a
Temperature298.15±n/a K
Ki 3e+3±n/a nM
Commentsextracted
Citation Neckles, CPschibul, ALai, CTHirschbeck, MKuper, JDavoodi, SZou, JLiu, NPan, PShah, SDaryaee, FBommineni, GRLai, CSimmerling, CKisker, CTonge, PJ Selectivity of Pyridone- and Diphenyl Ether-Based Inhibitors for the Yersinia pestis FabV Enoyl-ACP Reductase. Biochemistry55:2992-3006 (2016) 
 
Enoyl-[acyl-carrier-protein] reductase [NADH] [T276S]
Name:Enoyl-[acyl-carrier-protein] reductase [NADH] [T276S]
Type:Protein
Mol. Mass.:43321.97
Organism:Yersinia pestis (Enterobacteria)
Description:B1JRQ0[T276S]
Residue:399
BDBM190656
NameBDBM190656
Synonyms:PT424
TypeSmall organic molecule
Emp. Form.C18H22N2O3
Mol. Mass.314.3789
SMILESCCCCCCc1ccn(Cc2ccc(cc2)[N+]([O-])=O)c(=O)c1